{"text_format":"1","workbook":"xlsx","n_sheets":4,"sheets":["Begroting","Jaartabel","Keuzelijsten","Liquiditeitsprognose"],"not_rendered":{"charts":0,"images":1,"macros":1,"external_links":0,"defined_names":6,"comments":0,"pivot_tables":0},"unopened":[],"bounds":{"document_bytes":16777216,"sheet_cells":100000,"rows_first":2000,"rows_last":500,"rows_between":2000,"halvings":0,"cell_chars":16384,"cell_head_chars":4096},"cells_cut":0,"cells_raw":0,"read":"whole","date_system":"1900"}

{"sheet":"Begroting","index":0,"n_rows":78,"n_cols":38,"rows_kept":78,"cut":false,"hidden":false,"merged":[[6,5,11,7],[78,1,83,5],[14,1,15,3],[20,1,20,2],[19,2,19,3],[17,1,17,2]]}
[null,null,{"$f":"Jaartabel!$G6","v":1},{"$f":"Jaartabel!$G7","v":1},{"$f":"Jaartabel!$G8","v":1},null,null,{"$f":"Jaartabel!$G9","v":1},{"$f":"Jaartabel!$G10","v":1},{"$f":"Jaartabel!$G11","v":1},{"$f":"Jaartabel!$G12","v":1},{"$f":"Jaartabel!$G13","v":1},{"$f":"Jaartabel!$G14","v":1},{"$f":"Jaartabel!$G15","v":1},{"$f":"Jaartabel!$G16","v":1},{"$f":"Jaartabel!$G17","v":1},{"$f":"Jaartabel!$G18","v":1},{"$f":"Jaartabel!$G19","v":1},{"$f":"Jaartabel!$G20","v":1},{"$f":"Jaartabel!$G21","v":1},{"$f":"Jaartabel!$G22","v":1},{"$f":"Jaartabel!$G23","v":1},{"$f":"Jaartabel!$G24","v":1},{"$f":"Jaartabel!$G25","v":1},{"$f":"Jaartabel!$G26","v":0},{"$f":"Jaartabel!$G27","v":0},{"$f":"Jaartabel!$G28","v":0},{"$f":"Jaartabel!$G29","v":0},{"$f":"Jaartabel!$G30","v":0},{"$f":"Jaartabel!$G31","v":0},{"$f":"Jaartabel!$G32","v":0},{"$f":"Jaartabel!$G33","v":0},{"$f":"Jaartabel!$G34","v":0},{"$f":"Jaartabel!$G35","v":0},{"$f":"Jaartabel!$G36","v":0},{"$f":"Jaartabel!$G37","v":0},{"$f":"Jaartabel!$G38","v":0},{"$f":"Jaartabel!$G39","v":0}]
[null,null,{"$f":"Jaartabel!$H6","v":1},{"$f":"Jaartabel!$H7","v":1},{"$f":"Jaartabel!$H8","v":1},null,null,{"$f":"Jaartabel!$H9","v":1},{"$f":"Jaartabel!$H10","v":1},{"$f":"Jaartabel!$H11","v":1},{"$f":"Jaartabel!$H12","v":1},{"$f":"Jaartabel!$H13","v":1},{"$f":"Jaartabel!$H14","v":1},{"$f":"Jaartabel!$H15","v":1},{"$f":"Jaartabel!$H16","v":1},{"$f":"Jaartabel!$H17","v":1},{"$f":"Jaartabel!$H18","v":1},{"$f":"Jaartabel!$H19","v":1},{"$f":"Jaartabel!$H20","v":1},{"$f":"Jaartabel!$H21","v":1},{"$f":"Jaartabel!$H22","v":1},{"$f":"Jaartabel!$H23","v":1},{"$f":"Jaartabel!$H24","v":1},{"$f":"Jaartabel!$H25","v":1},{"$f":"Jaartabel!$H26","v":0},{"$f":"Jaartabel!$H27","v":0},{"$f":"Jaartabel!$H28","v":0},{"$f":"Jaartabel!$H29","v":0},{"$f":"Jaartabel!$H30","v":0},{"$f":"Jaartabel!$H31","v":0},{"$f":"Jaartabel!$H32","v":0},{"$f":"Jaartabel!$H33","v":0},{"$f":"Jaartabel!$H34","v":0},{"$f":"Jaartabel!$H35","v":0},{"$f":"Jaartabel!$H36","v":0},{"$f":"Jaartabel!$H37","v":0},{"$f":"Jaartabel!$H38","v":0},{"$f":"Jaartabel!$H39","v":0}]
[]
[]
[]
[null,"SVn_18_1_2022"]
[null,"Bereken de rente en aflossing van uw VvE lening",null,null,null,"Dit Excelmodel is een handreiking voor het inzichtelijk maken van gevraagde informatie met betrekking tot uw aanvraag. Het Excelmodel is een berekening van algemene aard en kwalificeert niet als enige vorm van advies of aanbeveling. SVn heeft het Excelmodel en de hierin opgenomen formules zorgvuldig opgesteld, maar mogelijk kunnen het Excelmodel en/of de gehanteerde formules niet (meer) kloppen of voor u passend zijn.  "]
[null,"Hoofdsom lening",100000,{"$f":"IF( OR( C8=0, C8=\"\" ), \"LET OP: vul hiernaast een getal in.\", \"\" )","v":""}]
[null,"Looptijd (in maanden)",240,{"$f":"IF( OR( C9=0, C9=\"\" ), \"LET OP: kies hiernaast een looptijd.\", \"\" )","v":""}]
[null,"Aangeboden rente",0.04,{"$f":"IF( OR( C10=0, C10=\"\" ), \"LET OP: vul hiernaast een percentage groter dan 0 in.\", \"\" )","v":""}]
[null,"Rente & aflossing per maand",{"$f":"-PMT(C10/12,C9,C8)","v":605.98032929941871}]
[null,"Rente & aflossing per jaar",{"$f":"-PMT(C10/12,C9,C8)*12","v":7271.7639515930241}]
[]
[null,"Toelichting"]
[null,"In kolom C, D en E vult u een inschatting van de opbrengsten en kosten die uw VvE verwacht. \nIn kolom F is ruimte voor een eventuele toelichting."]
[]
[]
[null,"Vul de witte velden s.v.p. in en het tabblad 'Liquiditeitsprognose'."]
[null,{"$f":"IF(SUM(Liquiditeitsprognose!D17:G17)=0,\"Let op: vergeet niet het tabblad 'Liquiditeitsprognose te vullen\",\"\")","v":"Let op: vergeet niet het tabblad 'Liquiditeitsprognose te vullen"}]
[null,"Naam VvE"]
[null,"Aanvraagnummer (indien bekend)"]
[null,"Geschatte ingangsdatum lening en (eventuele) verhoging servicekosten",null,null,{"$f":"IF( OR( D22=0, D22=\"\" ), \"LET OP: vul hiernaast een ingangsdatum.\", \"\" )","v":"LET OP: vul hiernaast een ingangsdatum."}]
[null,{"$f":"CONCATENATE( \"Inflatiepercentage toepassen op inkomsten en kosten (vanaf \", D26+1, \").\")","v":"Inflatiepercentage toepassen op inkomsten en kosten (vanaf 2024)."}]
[null,"Exploitatieresultaat toevoegen aan reserve"]
[]
[null,"Omschrijving",{"$f":"YEAR(TODAY())","v":2022},{"$f":"C26+1","v":2023},{"$f":"D26+1","v":2024},"Toelichting",null,{"$f":"E26+1","v":2025},{"$f":"H26+1","v":2026},2027,2028,2029,2030,2031,2032,2033,2034,2035,2036,2037,2038,2039,2040,2041,2042,2043,2044,2045,2046,2047,2048,2049,2050,2051,2052,2053,2054,2055]
[null,"Exploitatiebijdragen eigenaars tot ingang lening",0,0,{"$f":"D27*(1+$D$23)","v":0}]
[null,"Exploitatiebijdragen eigenaars na ingang lening",0,0,{"$f":"D28*(1+$D$23)","v":0},null,null,{"$f":"SUM(E27:E28)*(1+$D$23)","v":0},{"$f":"H28*(1+$D$23)","v":0},{"$f":"I28*(1+$D$23)","v":0},0,0,0,0,0,0,{"$f":"P28*(1+$D$23)*Q$1","v":0},0,0,{"$f":"S28*(1+$D$23)*T$1","v":0},0,0,0,0,0,0,0,0,0,0,0,0,0,0,0,0,0,0]
[null,"Bedrag aan ontvangen rente op de spaarrekening",0,0,{"$f":"D29*(1+$D$23)","v":0},null,null,{"$f":"E29*(1+$D$23)","v":0},0,0,0,0,0,0,0,0,{"$f":"P29*(1+$D$23)*Q$1","v":0},0,0,{"$f":"S29*(1+$D$23)*T$1","v":0},0,0,0,0,0,0,0,0,0,0,0,0,0,0,0,0,0,0]
[null,"Vergoedingen en tegemoetkomingen",0,0,{"$f":"D30*(1+$D$23)","v":0},null,null,{"$f":"E30*(1+$D$23)","v":0},0,0,0,0,0,0,0,0,{"$f":"P30*(1+$D$23)*Q$1","v":0},0,0,{"$f":"S30*(1+$D$23)*T$1","v":0},0,0,0,0,0,0,0,0,0,0,0,0,0,0,0,0,0,0]
{"$rows_left_out":49}
{"sheet":"Jaartabel","index":1,"n_rows":39,"n_cols":8,"rows_kept":39,"cut":false,"hidden":true,"merged":[]}
[]
[null,"Ingangsdatum",{"$f":"Begroting!D22","v":"00:00:00"}]
[]
[null,"Kalenderjaar","Jaar ja/nee","Maanden","Looptijd","Laatste jaar","Dummy jaar"]
[null,"Leeglaten"]
[null,{"$f":"Begroting!C26","v":2022},{"$f":"IF(B6>=YEAR(C$2),1,0)","v":1},{"$f":"IF(C6=0,0,IF(SUM(C5:C6)=1,13-MONTH(C$2),12))","v":12},{"$f":"MIN(SUM(D$6:D6),Begroting!C$9)","v":12},{"$f":"IF(AND(E6=Begroting!C$9,Jaartabel!E6<>Jaartabel!E5),1,0)","v":0},{"$f":"IF(C6=0,0,IF(SUM(F$5:F5)=1,0,1))","v":1},{"$f":"G6*(E6-E5)/12","v":1}]
[null,{"$f":"B6+1","v":2023},{"$f":"IF(B7>=YEAR(C$2),1,0)","v":1},{"$f":"IF(C7=0,0,IF(SUM(C6:C7)=1,13-MONTH(C$2),12))","v":12},{"$f":"MIN(SUM(D$6:D7),Begroting!C$9)","v":24},{"$f":"IF(AND(E7=Begroting!C$9,Jaartabel!E7<>Jaartabel!E6),1,0)","v":0},{"$f":"IF(C7=0,0,IF(SUM(F$5:F6)=1,0,1))","v":1},{"$f":"G7*(E7-E6)/12","v":1}]
[null,{"$f":"B7+1","v":2024},{"$f":"IF(B8>=YEAR(C$2),1,0)","v":1},{"$f":"IF(C8=0,0,IF(SUM(C7:C8)=1,13-MONTH(C$2),12))","v":12},{"$f":"MIN(SUM(D$6:D8),Begroting!C$9)","v":36},{"$f":"IF(AND(E8=Begroting!C$9,Jaartabel!E8<>Jaartabel!E7),1,0)","v":0},{"$f":"IF(C8=0,0,IF(SUM(F$5:F7)=1,0,1))","v":1},1]
[null,2025,1,12,{"$f":"MIN(SUM(D$6:D9),Begroting!C$9)","v":48},{"$f":"IF(AND(E9=Begroting!C$9,Jaartabel!E9<>Jaartabel!E8),1,0)","v":0},{"$f":"IF(C9=0,0,IF(SUM(F$5:F8)=1,0,1))","v":1},1]
[null,2026,1,12,{"$f":"MIN(SUM(D$6:D10),Begroting!C$9)","v":60},{"$f":"IF(AND(E10=Begroting!C$9,Jaartabel!E10<>Jaartabel!E9),1,0)","v":0},{"$f":"IF(C10=0,0,IF(SUM(F$5:F9)=1,0,1))","v":1},1]
[null,2027,1,12,{"$f":"MIN(SUM(D$6:D11),Begroting!C$9)","v":72},{"$f":"IF(AND(E11=Begroting!C$9,Jaartabel!E11<>Jaartabel!E10),1,0)","v":0},{"$f":"IF(C11=0,0,IF(SUM(F$5:F10)=1,0,1))","v":1},1]
[null,2028,1,12,{"$f":"MIN(SUM(D$6:D12),Begroting!C$9)","v":84},{"$f":"IF(AND(E12=Begroting!C$9,Jaartabel!E12<>Jaartabel!E11),1,0)","v":0},{"$f":"IF(C12=0,0,IF(SUM(F$5:F11)=1,0,1))","v":1},1]
[null,2029,1,12,{"$f":"MIN(SUM(D$6:D13),Begroting!C$9)","v":96},{"$f":"IF(AND(E13=Begroting!C$9,Jaartabel!E13<>Jaartabel!E12),1,0)","v":0},{"$f":"IF(C13=0,0,IF(SUM(F$5:F12)=1,0,1))","v":1},1]
[null,2030,1,12,{"$f":"MIN(SUM(D$6:D14),Begroting!C$9)","v":108},{"$f":"IF(AND(E14=Begroting!C$9,Jaartabel!E14<>Jaartabel!E13),1,0)","v":0},{"$f":"IF(C14=0,0,IF(SUM(F$5:F13)=1,0,1))","v":1},1]
[null,2031,1,12,{"$f":"MIN(SUM(D$6:D15),Begroting!C$9)","v":120},{"$f":"IF(AND(E15=Begroting!C$9,Jaartabel!E15<>Jaartabel!E14),1,0)","v":0},{"$f":"IF(C15=0,0,IF(SUM(F$5:F14)=1,0,1))","v":1},1]
[null,2032,1,12,{"$f":"MIN(SUM(D$6:D16),Begroting!C$9)","v":132},{"$f":"IF(AND(E16=Begroting!C$9,Jaartabel!E16<>Jaartabel!E15),1,0)","v":0},{"$f":"IF(C16=0,0,IF(SUM(F$5:F15)=1,0,1))","v":1},1]
[null,2033,1,12,{"$f":"MIN(SUM(D$6:D17),Begroting!C$9)","v":144},{"$f":"IF(AND(E17=Begroting!C$9,Jaartabel!E17<>Jaartabel!E16),1,0)","v":0},{"$f":"IF(C17=0,0,IF(SUM(F$5:F16)=1,0,1))","v":1},1]
[null,2034,1,12,{"$f":"MIN(SUM(D$6:D18),Begroting!C$9)","v":156},{"$f":"IF(AND(E18=Begroting!C$9,Jaartabel!E18<>Jaartabel!E17),1,0)","v":0},{"$f":"IF(C18=0,0,IF(SUM(F$5:F17)=1,0,1))","v":1},1]
[null,2035,1,12,{"$f":"MIN(SUM(D$6:D19),Begroting!C$9)","v":168},{"$f":"IF(AND(E19=Begroting!C$9,Jaartabel!E19<>Jaartabel!E18),1,0)","v":0},{"$f":"IF(C19=0,0,IF(SUM(F$5:F18)=1,0,1))","v":1},1]
[null,2036,1,12,{"$f":"MIN(SUM(D$6:D20),Begroting!C$9)","v":180},{"$f":"IF(AND(E20=Begroting!C$9,Jaartabel!E20<>Jaartabel!E19),1,0)","v":0},{"$f":"IF(C20=0,0,IF(SUM(F$5:F19)=1,0,1))","v":1},1]
[null,2037,1,12,{"$f":"MIN(SUM(D$6:D21),Begroting!C$9)","v":192},{"$f":"IF(AND(E21=Begroting!C$9,Jaartabel!E21<>Jaartabel!E20),1,0)","v":0},{"$f":"IF(C21=0,0,IF(SUM(F$5:F20)=1,0,1))","v":1},1]
[null,2038,1,12,{"$f":"MIN(SUM(D$6:D22),Begroting!C$9)","v":204},{"$f":"IF(AND(E22=Begroting!C$9,Jaartabel!E22<>Jaartabel!E21),1,0)","v":0},{"$f":"IF(C22=0,0,IF(SUM(F$5:F21)=1,0,1))","v":1},1]
[null,2039,1,12,{"$f":"MIN(SUM(D$6:D23),Begroting!C$9)","v":216},{"$f":"IF(AND(E23=Begroting!C$9,Jaartabel!E23<>Jaartabel!E22),1,0)","v":0},{"$f":"IF(C23=0,0,IF(SUM(F$5:F22)=1,0,1))","v":1},1]
[null,2040,1,12,{"$f":"MIN(SUM(D$6:D24),Begroting!C$9)","v":228},{"$f":"IF(AND(E24=Begroting!C$9,Jaartabel!E24<>Jaartabel!E23),1,0)","v":0},{"$f":"IF(C24=0,0,IF(SUM(F$5:F23)=1,0,1))","v":1},1]
[null,2041,1,12,{"$f":"MIN(SUM(D$6:D25),Begroting!C$9)","v":240},{"$f":"IF(AND(E25=Begroting!C$9,Jaartabel!E25<>Jaartabel!E24),1,0)","v":1},{"$f":"IF(C25=0,0,IF(SUM(F$5:F24)=1,0,1))","v":1},1]
[null,2042,1,12,{"$f":"MIN(SUM(D$6:D26),Begroting!C$9)","v":240},{"$f":"IF(AND(E26=Begroting!C$9,Jaartabel!E26<>Jaartabel!E25),1,0)","v":0},{"$f":"IF(C26=0,0,IF(SUM(F$5:F25)=1,0,1))","v":0},0]
[null,2043,1,12,{"$f":"MIN(SUM(D$6:D27),Begroting!C$9)","v":240},{"$f":"IF(AND(E27=Begroting!C$9,Jaartabel!E27<>Jaartabel!E26),1,0)","v":0},{"$f":"IF(C27=0,0,IF(SUM(F$5:F26)=1,0,1))","v":0},0]
[null,2044,1,12,{"$f":"MIN(SUM(D$6:D28),Begroting!C$9)","v":240},{"$f":"IF(AND(E28=Begroting!C$9,Jaartabel!E28<>Jaartabel!E27),1,0)","v":0},{"$f":"IF(C28=0,0,IF(SUM(F$5:F27)=1,0,1))","v":0},0]
[null,2045,1,12,{"$f":"MIN(SUM(D$6:D29),Begroting!C$9)","v":240},{"$f":"IF(AND(E29=Begroting!C$9,Jaartabel!E29<>Jaartabel!E28),1,0)","v":0},{"$f":"IF(C29=0,0,IF(SUM(F$5:F28)=1,0,1))","v":0},0]
[null,2046,1,12,{"$f":"MIN(SUM(D$6:D30),Begroting!C$9)","v":240},{"$f":"IF(AND(E30=Begroting!C$9,Jaartabel!E30<>Jaartabel!E29),1,0)","v":0},{"$f":"IF(C30=0,0,IF(SUM(F$5:F29)=1,0,1))","v":0},0]
{"$rows_left_out":10}
{"sheet":"Keuzelijsten","index":2,"n_rows":27,"n_cols":2,"rows_kept":27,"cut":false,"hidden":true,"merged":[]}
[]
[null,"Keuzelijsten"]
[null,"Looptijd"]
[null,120]
[null,180]
[null,240]
[null,360]
[]
[null,"ja/nee"]
[null,"ja"]
[null,"nee"]
[]
[null,"Inflatie"]
[null,0]
[null,0.01]
[null,0.02]
[null,0.03]
[null,0.04]
[null,0.05]
[null,0.06]
[null,7.0000000000000007E-2]
[null,0.08]
[null,0.09]
[null,0.1]
[]
[null,"Datum"]
[null,"2019-01-01"]

{"sheet":"Liquiditeitsprognose","index":3,"n_rows":30,"n_cols":36,"rows_kept":30,"cut":false,"hidden":false,"merged":[[30,1,35,2]]}
[null,null,null,{"$f":"Begroting!C1","v":1},{"$f":"Begroting!D1","v":1},{"$f":"Begroting!E1","v":1},{"$f":"Begroting!H1","v":1},{"$f":"Begroting!I1","v":1},{"$f":"Begroting!J1","v":1},{"$f":"Begroting!K1","v":1},{"$f":"Begroting!L1","v":1},{"$f":"Begroting!M1","v":1},{"$f":"Begroting!N1","v":1},{"$f":"Begroting!O1","v":1},{"$f":"Begroting!P1","v":1},{"$f":"Begroting!Q1","v":1},{"$f":"Begroting!R1","v":1},{"$f":"Begroting!S1","v":1},{"$f":"Begroting!T1","v":1},{"$f":"Begroting!U1","v":1},{"$f":"Begroting!V1","v":1},{"$f":"Begroting!W1","v":1},{"$f":"Begroting!X1","v":1},{"$f":"Begroting!Y1","v":0},{"$f":"Begroting!Z1","v":0},{"$f":"Begroting!AA1","v":0},{"$f":"Begroting!AB1","v":0},{"$f":"Begroting!AC1","v":0},{"$f":"Begroting!AD1","v":0},{"$f":"Begroting!AE1","v":0},{"$f":"Begroting!AF1","v":0},{"$f":"Begroting!AG1","v":0},{"$f":"Begroting!AH1","v":0},{"$f":"Begroting!AI1","v":0},{"$f":"Begroting!AJ1","v":0},{"$f":"Begroting!AK1","v":0}]
[null,null,null,1,1,1,{"$f":"VLOOKUP(G15,Jaartabel!$B$6:$G$39,6,FALSE)","v":1},{"$f":"VLOOKUP(H15,Jaartabel!$B$6:$G$39,6,FALSE)","v":1},{"$f":"VLOOKUP(I15,Jaartabel!$B$6:$G$39,6,FALSE)","v":1},{"$f":"VLOOKUP(J15,Jaartabel!$B$6:$G$39,6,FALSE)","v":1},{"$f":"VLOOKUP(K15,Jaartabel!$B$6:$G$39,6,FALSE)","v":1},{"$f":"VLOOKUP(L15,Jaartabel!$B$6:$G$39,6,FALSE)","v":1},{"$f":"VLOOKUP(M15,Jaartabel!$B$6:$G$39,6,FALSE)","v":1},{"$f":"VLOOKUP(N15,Jaartabel!$B$6:$G$39,6,FALSE)","v":1},{"$f":"VLOOKUP(O15,Jaartabel!$B$6:$G$39,6,FALSE)","v":1},{"$f":"VLOOKUP(P15,Jaartabel!$B$6:$G$39,6,FALSE)","v":1},{"$f":"VLOOKUP(Q15,Jaartabel!$B$6:$G$39,6,FALSE)","v":1},{"$f":"VLOOKUP(R15,Jaartabel!$B$6:$G$39,6,FALSE)","v":1},{"$f":"VLOOKUP(S15,Jaartabel!$B$6:$G$39,6,FALSE)","v":1},{"$f":"VLOOKUP(T15,Jaartabel!$B$6:$G$39,6,FALSE)","v":1},{"$f":"VLOOKUP(U15,Jaartabel!$B$6:$G$39,6,FALSE)","v":1},{"$f":"VLOOKUP(V15,Jaartabel!$B$6:$G$39,6,FALSE)","v":1},{"$f":"VLOOKUP(W15,Jaartabel!$B$6:$G$39,6,FALSE)","v":1},{"$f":"VLOOKUP(X15,Jaartabel!$B$6:$G$39,6,FALSE)","v":0},{"$f":"VLOOKUP(Y15,Jaartabel!$B$6:$G$39,6,FALSE)","v":0},{"$f":"VLOOKUP(Z15,Jaartabel!$B$6:$G$39,6,FALSE)","v":0},{"$f":"VLOOKUP(AA15,Jaartabel!$B$6:$G$39,6,FALSE)","v":0},{"$f":"VLOOKUP(AB15,Jaartabel!$B$6:$G$39,6,FALSE)","v":0},{"$f":"VLOOKUP(AC15,Jaartabel!$B$6:$G$39,6,FALSE)","v":0},{"$f":"VLOOKUP(AD15,Jaartabel!$B$6:$G$39,6,FALSE)","v":0},{"$f":"VLOOKUP(AE15,Jaartabel!$B$6:$G$39,6,FALSE)","v":0},{"$f":"VLOOKUP(AF15,Jaartabel!$B$6:$G$39,6,FALSE)","v":0},{"$f":"VLOOKUP(AG15,Jaartabel!$B$6:$G$39,6,FALSE)","v":0},{"$f":"VLOOKUP(AH15,Jaartabel!$B$6:$G$39,6,FALSE)","v":0},{"$f":"VLOOKUP(AI15,Jaartabel!$B$6:$G$39,6,FALSE)","v":0},{"$f":"VLOOKUP(AJ15,Jaartabel!$B$6:$G$39,6,FALSE)","v":0}]
[null,{"$f":"Begroting!B6","v":"SVn_18_1_2022"}]
[null,"Vul de witte velden s.v.p. in."]
[]
[null,"Uitgaven MJOP en inflatie"]
[null,"Vult u onder 'Uitgaven MJOP' (regel 18) de bedragen inclusief inflatie in?",null,"ja"]
[null,{"$f":"IF(D7=\"nee\",\"Zo nee, wilt u dat over de 'Uitgaven MJOP' (regel 17) inflatie wordt berekend?\",\"N.v.t.\")","v":"N.v.t."},null,"nee"]
[null,{"$f":"IF( D7=\"ja\", \"N.v.t.\", IF(D8 =\"nee\", \"Het MJOP wordt wel verhoogd met het inflatiepercentage uit tabblad 'Begroting'.\", \"Vul het gewenste inflatiepercentage in.\" ))","v":"N.v.t."},null,0.01]
[null,{"$f":"IF(D7=\"ja\",\"De 'Uitgaven MJOP' zijn reeds verhoogd met inflatie.\",IF(D9<Begroting!D23,\"Het MJOP wordt minimaal verhoogd met het inflatiepercentage uit tabblad 'Begroting'.\",\"Het MJOP wordt  verhoogd met het opgegeven inflatiepercentage.\"))","v":"De 'Uitgaven MJOP' zijn reeds verhoogd met inflatie."},null,{"$f":"IF(D7=\"nee\",MAX(D9,Begroting!D23),0)","v":0}]
[]
[null,null,"Jaar",1,1,2,3,4,5,6,7,8,9,10,11,12,13,14,15,16,17,18,19,20,21,22,23,24,25,26,27,28,29,30,31,32]
[null,null,"Inflatiefactor MJOP",{"$f":"IF($D7=\"ja\",1,(1+$D10)^(D12-1))","v":1},{"$f":"IF($D7=\"ja\",1,(1+$D10)^(E12-1))","v":1},{"$f":"IF($D7=\"ja\",1,(1+$D10)^(F12-1))","v":1},{"$f":"IF($D7=\"ja\",1,(1+$D10)^(G12-1))","v":1},{"$f":"IF($D7=\"ja\",1,(1+$D10)^(H12-1))","v":1},1,1,1,1,1,1,1,1,1,1,1,1,1,1,1,1,1,1,1,1,1,1,1,1,{"$f":"IF($D7=\"ja\",1,(1+$D10)^(AG12-1))","v":1},1,1,1]
[null,null,"Uitgaven MJOP (na inflatie)",{"$f":"D18*D13","v":0},{"$f":"E18*E13","v":0},0,0,0,0,0,0,0,0,0,0,0,0,0,0,0,0,0,0,0,0,0,0,0,0,0,0,0,{"$f":"AG18*AG13","v":0},{"$f":"AH18*AH13","v":0},0,0]
[null,"Omschrijving","Invulinstructie en toelichting",{"$f":"E15-1","v":2022},{"$f":"Begroting!D26","v":2023},{"$f":"E15+1","v":2024},2025,2026,2027,2028,2029,2030,2031,2032,2033,2034,2035,2036,2037,{"$f":"S15+1","v":2038},2039,2040,2041,2042,2043,2044,2045,2046,2047,2048,2049,{"$f":"AE15+1","v":2050},{"$f":"AF15+1","v":2051},{"$f":"AG15+1","v":2052},{"$f":"AH15+1","v":2053},{"$f":"AI15+1","v":2054}]
[null,"Totale reserves",{"$f":"CONCATENATE(\"Vul de stand van de reserves per 31-12-\",D15-1,\".\")","v":"Vul de stand van de reserves per 31-12-2021."},6000,{"$f":"D25","v":6000},{"$f":"E25","v":6000},{"$f":"F25","v":6000},6000,6000,6000,6000,6000,6000,6000,6000,6000,6000,6000,6000,{"$f":"S25","v":6000},{"$f":"T25","v":6000},{"$f":"U25","v":6000},{"$f":"V25","v":6000},{"$f":"W25","v":6000},{"$f":"X25","v":6000},{"$f":"Y25","v":6000},{"$f":"Z25","v":6000},{"$f":"AA25","v":6000},{"$f":"AB25","v":6000},{"$f":"AC25","v":6000},{"$f":"AD25","v":6000},{"$f":"AE25","v":6000},{"$f":"AF25","v":6000},{"$f":"AG25","v":6000},{"$f":"AH25","v":6000},{"$f":"AI25","v":6000}]
[null,"Uitgaven project verduurzaming","Dit moet minimaal gelijk zijn aan de VvE lening.",0,0,0,0]
[null,"Uitgaven MJOP","Vul per kalenderjaar de uitgaven uit het MJOP in.",0,0,0,0,0,0,0,0,0,0,0,0,0,0,0,0,0,0,0,0,0,0,0,0,0,0,0,0,0,0,0,0,0]
[null,"Uitgaven MJOP (na inflatie)","Dit zijn de uitgaven inclusief inflatie.",{"$f":"D14","v":0},0,{"$f":"F14","v":0},0,0,0,0,0,0,0,0,0,0,0,0,0,0,0,0,0,0,0,0,0,0,0,0,0,{"$f":"AF14","v":0},0,0,0,0]
[null,"VvE lening","Wordt gevuld vanuit tabblad 'Begroting'.",{"$f":"IF(D15=YEAR(Begroting!$D22),Begroting!$C8,0)","v":0},{"$f":"IF(E15=YEAR(Begroting!$D22),Begroting!$C8,0)","v":0},{"$f":"IF(F15=YEAR(Begroting!$D22),Begroting!$C8,0)","v":0}]
[null,"Subsidie","Handmatig invullen indien van toepassing.",0,0]
[null,"Dotatie","Wordt gevuld vanuit tabblad 'Begroting'.",{"$f":"Begroting!C45","v":0},{"$f":"Begroting!D45","v":0},{"$f":"Begroting!E45","v":0},{"$f":"Begroting!H45","v":0},{"$f":"Begroting!I45","v":0},{"$f":"Begroting!J45","v":0},{"$f":"Begroting!K45","v":0},{"$f":"Begroting!L45","v":0},{"$f":"Begroting!M45","v":0},{"$f":"Begroting!N45","v":0},{"$f":"Begroting!O45","v":0},{"$f":"Begroting!P45","v":0},{"$f":"Begroting!Q45","v":0},{"$f":"Begroting!R45","v":0},{"$f":"Begroting!S45","v":0},{"$f":"Begroting!T45","v":0},{"$f":"Begroting!U45","v":0},{"$f":"Begroting!V45","v":0},{"$f":"Begroting!W45","v":0},{"$f":"Begroting!X45","v":0},{"$f":"Begroting!Y45","v":0},{"$f":"Begroting!Z45","v":0},{"$f":"Begroting!AA45","v":0},{"$f":"Begroting!AB45","v":0},{"$f":"Begroting!AC45","v":0},{"$f":"Begroting!AD45","v":0},{"$f":"Begroting!AE45","v":0},{"$f":"Begroting!AF45","v":0},{"$f":"Begroting!AG45","v":0},{"$f":"Begroting!AH45","v":0},{"$f":"Begroting!AI45","v":0},{"$f":"Begroting!AJ45","v":0},{"$f":"Begroting!AK45","v":0}]
[null,"Eenmalige extra inleg","Optioneel: vul extra inleg in.",0,0,0,0,0,0,0,0,0,0,0,0,0,0,0,0,0,0,0,0,0,0,0,0,0,0,0,0,0,0,0,0,0]
[null,"Exploitatiesaldo","Wordt gevuld vanuit tabblad 'Begroting'.",{"$f":"Begroting!C75","v":-7271.7639515930241},{"$f":"Begroting!D75","v":-7271.7639515930241},{"$f":"Begroting!E75","v":-7271.7639515930241},{"$f":"Begroting!H75","v":-7271.7639515930241},{"$f":"Begroting!I75","v":-7271.7639515930241},{"$f":"Begroting!J75","v":-7271.7639515930241},{"$f":"Begroting!K75","v":-7271.7639515930241},{"$f":"Begroting!L75","v":-7271.7639515930241},{"$f":"Begroting!M75","v":-7271.7639515930241},{"$f":"Begroting!N75","v":-7271.7639515930241},{"$f":"Begroting!O75","v":-7271.7639515930241},{"$f":"Begroting!P75","v":-7271.7639515930241},{"$f":"Begroting!Q75","v":-7271.7639515930241},{"$f":"Begroting!R75","v":-7271.7639515930241},{"$f":"Begroting!S75","v":-7271.7639515930241},{"$f":"Begroting!T75","v":-7271.7639515930241},{"$f":"Begroting!U75","v":-7271.7639515930241},{"$f":"Begroting!V75","v":-7271.7639515930241},{"$f":"Begroting!W75","v":-7271.7639515930241},{"$f":"Begroting!X75","v":-7271.7639515930241},{"$f":"Begroting!Y75","v":0},{"$f":"Begroting!Z75","v":0},{"$f":"Begroting!AA75","v":0},{"$f":"Begroting!AB75","v":0},{"$f":"Begroting!AC75","v":0},{"$f":"Begroting!AD75","v":0},{"$f":"Begroting!AE75","v":0},{"$f":"Begroting!AF75","v":0},{"$f":"Begroting!AG75","v":0},{"$f":"Begroting!AH75","v":0},{"$f":"Begroting!AI75","v":0},{"$f":"Begroting!AJ75","v":0},{"$f":"Begroting!AK75","v":0}]
[null,"Totaal reserves","Dit is het saldo van de reserves per einde kalenderjaar",{"$f":"SUM(D16-D17-D19+D20+D21+D22+D23+IF(Begroting!$D24=\"ja\",D24,0))","v":6000},{"$f":"SUM(E16-E17-E19+E20+E21+E22+E23+IF(Begroting!$D24=\"ja\",E24,0))","v":6000},{"$f":"SUM(F16-F17-F19+F20+F21+F22+F23+IF(Begroting!$D24=\"ja\",F24,0))","v":6000},{"$f":"SUM(G16-G17-G19+G20+G21+G22+G23+IF(Begroting!$D24=\"ja\",G24,0))","v":6000},{"$f":"SUM(H16-H17-H19+H20+H21+H22+H23+IF(Begroting!$D24=\"ja\",H24,0))","v":6000},{"$f":"SUM(I16-I17-I19+I20+I21+I22+I23+IF(Begroting!$D24=\"ja\",I24,0))","v":6000},{"$f":"SUM(J16-J17-J19+J20+J21+J22+J23+IF(Begroting!$D24=\"ja\",J24,0))","v":6000},{"$f":"SUM(K16-K17-K19+K20+K21+K22+K23+IF(Begroting!$D24=\"ja\",K24,0))","v":6000},{"$f":"SUM(L16-L17-L19+L20+L21+L22+L23+IF(Begroting!$D24=\"ja\",L24,0))","v":6000},{"$f":"SUM(M16-M17-M19+M20+M21+M22+M23+IF(Begroting!$D24=\"ja\",M24,0))","v":6000},{"$f":"SUM(N16-N17-N19+N20+N21+N22+N23+IF(Begroting!$D24=\"ja\",N24,0))","v":6000},{"$f":"SUM(O16-O17-O19+O20+O21+O22+O23+IF(Begroting!$D24=\"ja\",O24,0))","v":6000},{"$f":"SUM(P16-P17-P19+P20+P21+P22+P23+IF(Begroting!$D24=\"ja\",P24,0))","v":6000},{"$f":"SUM(Q16-Q17-Q19+Q20+Q21+Q22+Q23+IF(Begroting!$D24=\"ja\",Q24,0))","v":6000},{"$f":"SUM(R16-R17-R19+R20+R21+R22+R23+IF(Begroting!$D24=\"ja\",R24,0))","v":6000},{"$f":"SUM(S16-S17-S19+S20+S21+S22+S23+IF(Begroting!$D24=\"ja\",S24,0))","v":6000},{"$f":"SUM(T16-T17-T19+T20+T21+T22+T23+IF(Begroting!$D24=\"ja\",T24,0))","v":6000},{"$f":"SUM(U16-U17-U19+U20+U21+U22+U23+IF(Begroting!$D24=\"ja\",U24,0))","v":6000},{"$f":"SUM(V16-V17-V19+V20+V21+V22+V23+IF(Begroting!$D24=\"ja\",V24,0))","v":6000},{"$f":"SUM(W16-W17-W19+W20+W21+W22+W23+IF(Begroting!$D24=\"ja\",W24,0))","v":6000},{"$f":"SUM(X16-X17-X19+X20+X21+X22+X23+IF(Begroting!$D24=\"ja\",X24,0))","v":6000},{"$f":"SUM(Y16-Y17-Y19+Y20+Y21+Y22+Y23+IF(Begroting!$D24=\"ja\",Y24,0))","v":6000},{"$f":"SUM(Z16-Z17-Z19+Z20+Z21+Z22+Z23+IF(Begroting!$D24=\"ja\",Z24,0))","v":6000},{"$f":"SUM(AA16-AA17-AA19+AA20+AA21+AA22+AA23+IF(Begroting!$D24=\"ja\",AA24,0))","v":6000},{"$f":"SUM(AB16-AB17-AB19+AB20+AB21+AB22+AB23+IF(Begroting!$D24=\"ja\",AB24,0))","v":6000},{"$f":"SUM(AC16-AC17-AC19+AC20+AC21+AC22+AC23+IF(Begroting!$D24=\"ja\",AC24,0))","v":6000},{"$f":"SUM(AD16-AD17-AD19+AD20+AD21+AD22+AD23+IF(Begroting!$D24=\"ja\",AD24,0))","v":6000},{"$f":"SUM(AE16-AE17-AE19+AE20+AE21+AE22+AE23+IF(Begroting!$D24=\"ja\",AE24,0))","v":6000},{"$f":"SUM(AF16-AF17-AF19+AF20+AF21+AF22+AF23+IF(Begroting!$D24=\"ja\",AF24,0))","v":6000},{"$f":"SUM(AG16-AG17-AG19+AG20+AG21+AG22+AG23+IF(Begroting!$D24=\"ja\",AG24,0))","v":6000},{"$f":"SUM(AH16-AH17-AH19+AH20+AH21+AH22+AH23+IF(Begroting!$D24=\"ja\",AH24,0))","v":6000},{"$f":"SUM(AI16-AI17-AI19+AI20+AI21+AI22+AI23+IF(Begroting!$D24=\"ja\",AI24,0))","v":6000},{"$f":"SUM(AJ16-AJ17-AJ19+AJ20+AJ21+AJ22+AJ23+IF(Begroting!$D24=\"ja\",AJ24,0))","v":6000}]
[null,"Rekenregel",null,{"$f":"D2*D25","v":6000},{"$f":"E2*E25","v":6000},{"$f":"F2*F25","v":6000},6000,6000,6000,6000,6000,6000,6000,6000,6000,6000,6000,6000,6000,6000,6000,6000,6000,0,{"$f":"Y2*Y25","v":0},0,0,0,0,0,0,0,0,0,0,0]
[null,"Check reserves",{"$f":"IF(Begroting!C9=120,IF(COUNTIF(D26:N26,\"<\"&0)>0,\"Aanpassing vereist: de reserves zijn niet elk jaar positief.\",\"Saldo reserves is elk jaar positief.\"),\nIF(Begroting!C9=180,IF(COUNTIF(D26:S26,\"<\"&0)>0,\"Aanpassing vereist: de reserves zijn niet elk jaar positief.\",\"Saldo reserves is elk jaar positief.\"),\nIF(Begroting!C9=240,IF(COUNTIF(D26:X26,\"<\"&0)>0,\"Aanpassing vereist: de reserves zijn niet elk jaar positief.\",\"Saldo reserves is elk jaar positief.\"),\nIF(Begroting!C9=360,IF(COUNTIF(D26:AH26,\"<\"&Begroting!D71)>0,\"Aanpassing vereist: de reserves zijn niet elk jaar voldoende positief (minimumreserve = jaarlast van de lening).\",\"Saldo reserves is elk jaar positief.\")))))","v":"Saldo reserves is elk jaar positief."}]
[null,"Check lening",{"$f":" IF( SUM(D17:G17) < Begroting!C8, \"Het totaal van D17 tm G17 moet minimaal gelijk zijn aan de hoofdsom van de VvE lening.\", \" \" )","v":"Het totaal van D17 tm G17 moet minimaal gelijk zijn aan de hoofdsom van de VvE lening."}]
[]
[null,"Bijzonderheden/toelichting"]